[Ffmpeg-devel] [Ffmpeg-devel-old] compile error w/ gcc 4.0 in x264.c

Cheryl cheryl
Fri Oct 28 21:23:32 CEST 2005

Hello all,

when attempting to compile the latest CVS, as of 10/28 this is 
what results:

gcc -O3 -g -Wall -Wno-switch  -DHAVE_AV_CONFIG_H -I.. 
x264.c: In function 'X264_init':
x264.c:137: error: 'struct <anonymous>' has no member named 
x264.c:138: error: 'struct <anonymous>' has no member named 
x264.c:162: error: 'x264_param_t' has no member named 'i_threads'
make: *** [x264.o] Error 1

This SF.Net email is sponsored by the JBoss Inc.
Get Certified Today * Register for a JBoss Training Course
Free Certification Exam for All Training Attendees Through End of 2005
Visit http://www.jboss.com/services/certification for more information
Ffmpeg-devel mailing list
Ffmpeg-devel at lists.sourceforge.net

More information about the ffmpeg-devel mailing list